为了账号安全,请及时绑定邮箱和手机立即绑定

运行react-native run-android出错,好多天了

Welcome to Gradle 6.0.1!


Here are the highlights of this release:

 - Substantial improvements in dependency management, including

   - Publishing Gradle Module Metadata in addition to pom.xml

   - Advanced control of transitive versions

   - Support for optional features and dependencies

   - Rules to tweak published metadata

 - Support for Java 13

 - Faster incremental Java and Groovy compilation

 - New Zinc compiler for Scala

 - VS2019 support

 - Support for Gradle Enterprise plugin 3.0


For more details see https://docs.gradle.org/6.0.1/release-notes.html


Starting a Gradle Daemon (subsequent builds will be faster)


Deprecated Gradle features were used in this build, making it incompatible with Gradle 7.0.

Use '--warning-mode all' to show the individual deprecation warnings.

See https://docs.gradle.org/6.0.1/userguide/command_line_interface.html#sec:command_line_warnings


FAILURE: Build failed with an exception.


* What went wrong:

A problem occurred configuring project ':app'.

> Failed to notify project evaluation listener.

   > Uninitialized object exists on backward branch 142

     Exception Details:

       Location:

         com/android/build/gradle/internal/pipeline/VariantInfoImpl.<init>(Lcom/android/build/gradle/internal/scope/VariantScope;)V @200: goto

       Reason:

         Error exists in the bytecode

       Bytecode:

         0x0000000: 2b12 3cb8 0034 2a2b b900 4201 0059 1244

         0x0000010: b800 47b6 004d b900 5201 002b b900 5401

         0x0000020: 0059 1256 b800 472b b900 4201 0059 1244

         0x0000030: b800 47b6 005a c000 5c59 125e b800 47b9

         0x0000040: 0061 0100 5912 63b8 0047 2bb9 0042 0100

         0x0000050: 5912 44b8 0047 b600 6759 1269 b800 47c0

         0x0000060: 006b 4d3a 0e3a 0d36 0c3a 0b03 3e2c 3a04

         0x0000070: bb00 6d59 2c10 0ab8 0073 b700 76c0 0078

         0x0000080: 3a05 0336 0619 04b9 007c 0100 3a07 1907

         0x0000090: b900 8101 0099 0036 1907 b900 8501 003a

         0x00000a0: 0819 0519 08c0 0087 3a09 3a0f 0336 0a19

         0x00000b0: 0959 1289 b800 47b9 008a 0100 3a10 190f

         0x00000c0: 1910 b900 8e02 0057 a7ff c619 05c0 0090

         0x00000d0: 3a0f 190b 150c 190d 190e 190f c000 6bb8

         0x00000e0: 0096 2bb9 0042 0100 5912 44b8 0047 b600

         0x00000f0: 5ac0 005c 5912 5eb8 0047 b900 9801 00b7

         0x0000100: 009a b1

       Stackmap Table:

         full_frame(@142,{UninitializedThis,Object[#62],Object[#107],Integer,Object[#107],Object[#120],Integer,Object[#126],Top,Top,Top,UninitializedThis,Integer,Object[#169],Object[#169]},{})

         same_frame(@203)



* Try:

Run with --stacktrace option to get the stack trace. Run with --info or --debug option to get more log output. Run with --scan to get full insights.


* Get more help at https://help.gradle.org


BUILD FAILED in 2m 23s


error Failed to install the app. Make sure you have the Android development environment set up: https://reactnative.dev/docs/getting-started.html#android-development-environment. Run CLI with --verbose flag for more details.

Error: Command failed: gradlew.bat app:installDebug -PreactNativeDevServerPort=8081


FAILURE: Build failed with an exception.


* What went wrong:

A problem occurred configuring project ':app'.

> Failed to notify project evaluation listener.

   > Uninitialized object exists on backward branch 142

     Exception Details:

       Location:

         com/android/build/gradle/internal/pipeline/VariantInfoImpl.<init>(Lcom/android/build/gradle/internal/scope/VariantScope;)V @200: goto

       Reason:

         Error exists in the bytecode

       Bytecode:

         0x0000000: 2b12 3cb8 0034 2a2b b900 4201 0059 1244

         0x0000010: b800 47b6 004d b900 5201 002b b900 5401

         0x0000020: 0059 1256 b800 472b b900 4201 0059 1244

         0x0000030: b800 47b6 005a c000 5c59 125e b800 47b9

         0x0000040: 0061 0100 5912 63b8 0047 2bb9 0042 0100

         0x0000050: 5912 44b8 0047 b600 6759 1269 b800 47c0

         0x0000060: 006b 4d3a 0e3a 0d36 0c3a 0b03 3e2c 3a04

         0x0000070: bb00 6d59 2c10 0ab8 0073 b700 76c0 0078

         0x0000080: 3a05 0336 0619 04b9 007c 0100 3a07 1907

         0x0000090: b900 8101 0099 0036 1907 b900 8501 003a

         0x00000a0: 0819 0519 08c0 0087 3a09 3a0f 0336 0a19

         0x00000b0: 0959 1289 b800 47b9 008a 0100 3a10 190f

         0x00000c0: 1910 b900 8e02 0057 a7ff c619 05c0 0090

         0x00000d0: 3a0f 190b 150c 190d 190e 190f c000 6bb8

         0x00000e0: 0096 2bb9 0042 0100 5912 44b8 0047 b600

         0x00000f0: 5ac0 005c 5912 5eb8 0047 b900 9801 00b7

         0x0000100: 009a b1

       Stackmap Table:

         full_frame(@142,{UninitializedThis,Object[#62],Object[#107],Integer,Object[#107],Object[#120],Integer,Object[#126],Top,Top,Top,UninitializedThis,Integer,Object[#169],Object[#169]},{})

         same_frame(@203)



* Try:

Run with --stacktrace option to get the stack trace. Run with --info or --debug option to get more log output. Run with --scan to get full insights.


* Get more help at https://help.gradle.org


BUILD FAILED in 2m 23s


    at makeError (D:\android\reactNative\FirstApp\node_modules\execa\index.js:174:9)

    at D:\android\reactNative\FirstApp\node_modules\execa\index.js:278:16

    at processTicksAndRejections (internal/process/task_queues.js:97:5)

    at async runOnAllDevices (D:\android\reactNative\FirstApp\node_modules\@react-native-community\cli-platform-android\build\commands\runAndroid\runOnAllDevices.js:94:5)

    at async Command.handleAction (D:\android\reactNative\FirstApp\node_modules\@react-native-community\cli\build\index.js:186:9)


正在回答

举报

0/150
提交
取消
ReactNative入门与进阶
  • 参与学习       71416    人
  • 解答问题       159    个

React Native跨平台技术入门与进阶

进入课程

运行react-native run-android出错,好多天了

我要回答 关注问题
意见反馈 帮助中心 APP下载
官方微信